Target
DNA topoisomerase 4 subunit B
Ligand
BDBM50393080
Substrate
Meas. Tech.
ChEMBL_853607 (CHEMBL2154062)
Ki
30±n/a nM
Citation
 Abdel-Magid, AF Combatting Drug-Resistant Bacteria with Gyrase and Topoisomerase IV Inhibitors: Patent Highlight. ACS Med Chem Lett 3:783-784 (2012)  
Target
Name:
DNA topoisomerase 4 subunit B
Synonyms:
DNA topoisomerase 4 subunit B PARE_STAA8 grlB | parE
Type:
Enzyme
Mol. Mass.:
74365.92
Organism:
Staphylococcus aureus
Description:
Q2FYS5
Residue:
663
  
Inhibitor
Name:
BDBM50393080
Synonyms:
CHEMBL2152856
Type:
Small organic molecule
Emp. Form.:
C21H24FN6O6P
Mol. Mass.:
506.4251
SMILES:
CCNC(=O)Nc1nc2cc(c(F)c([C@H]3CCCO3)c2[nH]1)-c1cnc(nc1)C(C)(C)OP([O-])([O-])=O
: