Target
Microtubule-associated protein tau
Ligand
BDBM50393083
Substrate
Meas. Tech.
ChEMBL_853608 (CHEMBL2154063)
EC50
325±n/a nM
Citation
 Rotella, DP Novel compounds for the treatment of neurodegenerative diseases: patent highlight. ACS Med Chem Lett 3:788-788 (2012)  
Target
Name:
Microtubule-associated protein tau
Synonyms:
MAPT MTBT1 Neurofibrillary tangle protein Paired helical filament-tau TAU_HUMAN | Tau Protein
Type:
Protein
Mol. Mass.:
78928.63
Organism:
Homo sapiens (Human)
Description:
P10636
Residue:
758
  
Inhibitor
Name:
BDBM50393083
Synonyms:
CHEMBL2152859
Type:
Small organic molecule
Emp. Form.:
C24H18ClN3O
Mol. Mass.:
399.872
SMILES:
Clc1ccc2[nH]cc(CCNC(=O)c3ccccc3-c3ccc(cc3)C#N)c2c1
: