Target
AP2-associated protein kinase 1
Ligand
BDBM50393109
Substrate
Meas. Tech.
ChEMBL_853854 (CHEMBL2154880)
Kd
1500±n/a nM
Citation
 Shengule, SRLoa-Kum-Cheung, WLParish, CRBlairvacq, MMeijer, LNakao, YKaruso, P A one-pot synthesis and biological activity of ageladine A and analogues. J Med Chem 54:2492-503 (2011)  
Target
Name:
AP2-associated protein kinase 1
Synonyms:
AAK1 Adaptor-associated kinase 1 | KIAA1048
Type:
PROTEIN
Mol. Mass.:
103884.23
Organism:
Homo sapiens (Human)
Description:
ChEMBL_774569
Residue:
961
  
Inhibitor
Name:
BDBM50393109
Synonyms:
CHEMBL2153264
Type:
Small organic molecule
Emp. Form.:
C11H9N5
Mol. Mass.:
211.2227
SMILES:
Nc1nc2c(nccc2[nH]1)-c1ccccn1
: