Target
Bromodomain-containing protein 2
Ligand
BDBM50365264
Substrate
Meas. Tech.
ChEMBL_852810 (CHEMBL2156117)
IC50
29.9±n/a nM
Citation
 Chung, CWCoste, HWhite, JHMirguet, OWilde, JGosmini, RLDelves, CMagny, SMWoodward, RHughes, SABoursier, EVFlynn, HBouillot, AMBamborough, PBrusq, JMGellibert, FJJones, EJRiou, AMHomes, PMartin, SLUings, IJToum, JClement, CABoullay, ABGrimley, RLBlandel, FMPrinjha, RKLee, KKirilovsky, JNicodeme, E Discovery and characterization of small molecule inhibitors of the BET family bromodomains. J Med Chem 54:3827-38 (2011)  
Target
Name:
Bromodomain-containing protein 2
Synonyms:
BRD2 Bromodomain and extra-terminal motif (BET) Bromodomain-containing protein 2 (BRD2) RING3
Type:
Protein
Mol. Mass.:
88085.95
Organism:
Homo sapiens (Human)
Description:
P25440
Residue:
801
  
Inhibitor
Name:
BDBM50365264
Synonyms:
CHEMBL1738926
Type:
Small organic molecule
Emp. Form.:
C25H21N5O2
Mol. Mass.:
423.4665
SMILES:
Cc1nnc2[C@H](NC(=O)OCc3ccccc3)N=C(c3ccccc3)c3ccccc3-n12
: