Target
Bromodomain-containing protein 3
Ligand
BDBM50365264
Substrate
Meas. Tech.
ChEMBL_852811 (CHEMBL2156118)
IC50
28.4±n/a nM
Citation
 Chung, CWCoste, HWhite, JHMirguet, OWilde, JGosmini, RLDelves, CMagny, SMWoodward, RHughes, SABoursier, EVFlynn, HBouillot, AMBamborough, PBrusq, JMGellibert, FJJones, EJRiou, AMHomes, PMartin, SLUings, IJToum, JClement, CABoullay, ABGrimley, RLBlandel, FMPrinjha, RKLee, KKirilovsky, JNicodeme, E Discovery and characterization of small molecule inhibitors of the BET family bromodomains. J Med Chem 54:3827-38 (2011)  
Target
Name:
Bromodomain-containing protein 3
Synonyms:
BRD3 Bromodomain and extra-terminal motif (BET) Bromodomain-containing protein 3 (BRD3) RING3-like protein | RING3L
Type:
Protein
Mol. Mass.:
79571.81
Organism:
Homo sapiens (Human)
Description:
Q15059
Residue:
726
  
Inhibitor
Name:
BDBM50365264
Synonyms:
CHEMBL1738926
Type:
Small organic molecule
Emp. Form.:
C25H21N5O2
Mol. Mass.:
423.4665
SMILES:
Cc1nnc2[C@H](NC(=O)OCc3ccccc3)N=C(c3ccccc3)c3ccccc3-n12
: