Target
Bromodomain-containing protein 2
Ligand
BDBM50365463
Substrate
Meas. Tech.
ChEMBL_852810 (CHEMBL2156117)
IC50
32.5±n/a nM
Citation
 Chung, CWCoste, HWhite, JHMirguet, OWilde, JGosmini, RLDelves, CMagny, SMWoodward, RHughes, SABoursier, EVFlynn, HBouillot, AMBamborough, PBrusq, JMGellibert, FJJones, EJRiou, AMHomes, PMartin, SLUings, IJToum, JClement, CABoullay, ABGrimley, RLBlandel, FMPrinjha, RKLee, KKirilovsky, JNicodeme, E Discovery and characterization of small molecule inhibitors of the BET family bromodomains. J Med Chem 54:3827-38 (2011)  
Target
Name:
Bromodomain-containing protein 2
Synonyms:
BRD2 Bromodomain and extra-terminal motif (BET) Bromodomain-containing protein 2 (BRD2) RING3
Type:
Protein
Mol. Mass.:
88085.95
Organism:
Homo sapiens (Human)
Description:
P25440
Residue:
801
  
Inhibitor
Name:
BDBM50365463
Synonyms:
CHEMBL1232461
Type:
Small organic molecule
Emp. Form.:
C22H22ClN5O2
Mol. Mass.:
423.895
SMILES:
CCNC(=O)C[C@@H]1N=C(c2ccc(Cl)cc2)c2cc(OC)ccc2-n2c(C)nnc12
: