Target
Succinate receptor 1
Ligand
BDBM50393134
Substrate
Meas. Tech.
ChEMBL_852820 (CHEMBL2156127)
IC50
19±n/a nM
Citation
 Bhuniya, DUmrani, DDave, BSalunke, DKukreja, GGundu, JNaykodi, MShaikh, NSShitole, PKurhade, SDe, SMajumdar, SReddy, SBTambe, SShejul, YChugh, APalle, VPMookhtiar, KACully, DVacca, JChakravarty, PKNargund, RPWright, SDGraziano, MPSingh, SBRoy, SCai, TQ Discovery of a potent and selective small molecule hGPR91 antagonist. Bioorg Med Chem Lett 21:3596-602 (2011)  
Target
Name:
Succinate receptor 1
Synonyms:
G-protein coupled receptor 91 P2Y purinoceptor 1-like SUCR1_HUMAN
Type:
PROTEIN
Mol. Mass.:
38709.48
Organism:
Homo sapiens (Human)
Description:
ChEMBL_852820
Residue:
334
  
Inhibitor
Name:
BDBM50393134
Synonyms:
CHEMBL2153466
Type:
Small organic molecule
Emp. Form.:
C31H21F6N3O
Mol. Mass.:
565.5084
SMILES:
C[C@H](NC(=O)C(F)(F)c1ccc(cc1)-c1ccc2cccnc2n1)c1ccc(cc1)-c1ccc(F)c(c1)C(F)(F)F
: