Target
Succinate receptor 1
Ligand
BDBM50393140
Substrate
Meas. Tech.
ChEMBL_852820 (CHEMBL2156127)
IC50
210±n/a nM
Citation
 Bhuniya, DUmrani, DDave, BSalunke, DKukreja, GGundu, JNaykodi, MShaikh, NSShitole, PKurhade, SDe, SMajumdar, SReddy, SBTambe, SShejul, YChugh, APalle, VPMookhtiar, KACully, DVacca, JChakravarty, PKNargund, RPWright, SDGraziano, MPSingh, SBRoy, SCai, TQ Discovery of a potent and selective small molecule hGPR91 antagonist. Bioorg Med Chem Lett 21:3596-602 (2011)  
Target
Name:
Succinate receptor 1
Synonyms:
G-protein coupled receptor 91 P2Y purinoceptor 1-like SUCR1_HUMAN
Type:
PROTEIN
Mol. Mass.:
38709.48
Organism:
Homo sapiens (Human)
Description:
ChEMBL_852820
Residue:
334
  
Inhibitor
Name:
BDBM50393140
Synonyms:
CHEMBL2153472
Type:
Small organic molecule
Emp. Form.:
C23H19F4N5O
Mol. Mass.:
457.4235
SMILES:
Fc1ccc(cc1C(F)(F)F)-n1cc(CNC(=O)CCCc2ccc3cccnc3n2)cn1
: