Target
5-hydroxytryptamine receptor 3A
Ligand
BDBM50190783
Substrate
Meas. Tech.
ChEMBL_851152 (CHEMBL2157809)
Ki
310±n/a nM
Citation
 Mazurov, AASpeake, JDYohannes, D Discovery and development ofa7 nicotinic acetylcholine receptor modulators. J Med Chem 54:7943-61 (2011)  
Target
Name:
5-hydroxytryptamine receptor 3A
Synonyms:
5-HT-3 5-HT3A 5-hydroxytryptamine receptor 3 (5-HT3) 5-hydroxytryptamine receptor 3A (5HT3A) 5HT3R HTR3A Serotonin 3 receptor (5HT3) Serotonin-gated ion channel receptor | Serotonin-gated ion channel receptor 3
Type:
Protein
Mol. Mass.:
55283.27
Organism:
Homo sapiens (Human)
Description:
P46098
Residue:
478
  
Inhibitor
Name:
BDBM50190783
Synonyms:
CHEMBL379302 | N-[(3R)-1-azabicyclo[2.2.2]oct-3-yl]-1-benzofuran-6-carboxamide
Type:
Small organic molecule
Emp. Form.:
C16H18N2O2
Mol. Mass.:
270.3263
SMILES:
O=C(N[C@H]1CN2CCC1CC2)c1ccc2ccoc2c1
: