Target
Neuronal acetylcholine receptor subunit alpha-7
Ligand
BDBM50393252
Substrate
Meas. Tech.
ChEMBL_851161 (CHEMBL2157818)
Ki
7±n/a nM
Citation
 Mazurov, AASpeake, JDYohannes, D Discovery and development ofa7 nicotinic acetylcholine receptor modulators. J Med Chem 54:7943-61 (2011)  
Target
Name:
Neuronal acetylcholine receptor subunit alpha-7
Synonyms:
ACHA7_HUMAN Cholinergic, Nicotinic Alpha7 Neuronal acetylcholine receptor protein alpha-7 subunit Nicotinic acetylcholine receptor alpha-7 (alpha7 nAChR)
Type:
Mol. Mass.:
56448.33
Organism:
Homo sapiens (Human)
Description:
CHRNA7 (NACHRA7)
Residue:
502
  
Inhibitor
Name:
BDBM50393252
Synonyms:
CHEMBL2151570
Type:
Small organic molecule
Emp. Form.:
C19H20N4O
Mol. Mass.:
320.3883
SMILES:
C1CN2CCC1[C@H](C2)Oc1ccc(nn1)-c1ccc2[nH]ccc2c1
: