Target
Neuronal acetylcholine receptor subunit alpha-7
Ligand
BDBM50164618
Substrate
Meas. Tech.
ChEMBL_851150 (CHEMBL2157807)
Ki
9±n/a nM
Citation
 Mazurov, AASpeake, JDYohannes, D Discovery and development ofa7 nicotinic acetylcholine receptor modulators. J Med Chem 54:7943-61 (2011)  
Target
Name:
Neuronal acetylcholine receptor subunit alpha-7
Synonyms:
ACHA7_HUMAN Cholinergic, Nicotinic Alpha7 Neuronal acetylcholine receptor protein alpha-7 subunit Nicotinic acetylcholine receptor alpha-7 (alpha7 nAChR)
Type:
Mol. Mass.:
56448.33
Organism:
Homo sapiens (Human)
Description:
CHRNA7 (NACHRA7)
Residue:
502
  
Inhibitor
Name:
BDBM50164618
Synonyms:
(2R)-3'-(5-chlorothien-2-yl)-2'H-spiro[4-azabicyclo[2.2.2]octane-2,5'-[1,3]oxazolidin]-2'-one | CHEMBL192704
Type:
Small organic molecule
Emp. Form.:
C13H15ClN2O2S
Mol. Mass.:
298.788
SMILES:
Clc1ccc(s1)N1C[C@@]2(CN3CCC2CC3)OC1=O
: