Target
Ubiquitin carboxyl-terminal hydrolase 47
Ligand
BDBM50393441
Substrate
Meas. Tech.
ChEMBL_855560 (CHEMBL2162865)
EC50
2200±n/a nM
Citation
 Weinstock, JWu, JCao, PKingsbury, WDMcDermott, JLKodrasov, MPMcKelvey, DMSuresh Kumar, KGGoldenberg, SJMattern, MRNicholson, B Selective Dual Inhibitors of the Cancer-Related Deubiquitylating Proteases USP7 and USP47. ACS Med Chem Lett 3:789-792 (2012)  
Target
Name:
Ubiquitin carboxyl-terminal hydrolase 47
Synonyms:
Deubiquitinating enzyme 47 USP47 Ubiquitin-specific-processing protease 47
Type:
PROTEIN
Mol. Mass.:
157255.08
Organism:
Homo sapiens (Human)
Description:
ChEMBL_855560
Residue:
1375
  
Inhibitor
Name:
BDBM50393441
Synonyms:
CHEMBL2159499
Type:
Small organic molecule
Emp. Form.:
C12H7Cl2NO3S2
Mol. Mass.:
348.225
SMILES:
CC(=O)c1cc(c(Sc2c(Cl)cccc2Cl)s1)[N+]([O-])=O
: