Target
Ubiquitin carboxyl-terminal hydrolase 47
Ligand
BDBM50393443
Substrate
Meas. Tech.
ChEMBL_855560 (CHEMBL2162865)
EC50
5500±n/a nM
Citation
 Weinstock, JWu, JCao, PKingsbury, WDMcDermott, JLKodrasov, MPMcKelvey, DMSuresh Kumar, KGGoldenberg, SJMattern, MRNicholson, B Selective Dual Inhibitors of the Cancer-Related Deubiquitylating Proteases USP7 and USP47. ACS Med Chem Lett 3:789-792 (2012)  
Target
Name:
Ubiquitin carboxyl-terminal hydrolase 47
Synonyms:
Deubiquitinating enzyme 47 USP47 Ubiquitin-specific-processing protease 47
Type:
PROTEIN
Mol. Mass.:
157255.08
Organism:
Homo sapiens (Human)
Description:
ChEMBL_855560
Residue:
1375
  
Inhibitor
Name:
BDBM50393443
Synonyms:
CHEMBL2159502
Type:
Small organic molecule
Emp. Form.:
C17H17Cl2N3O3S2
Mol. Mass.:
446.371
SMILES:
CN1CCC(CC1)NC(=O)c1cc(c(Sc2c(Cl)cccc2Cl)s1)[N+]([O-])=O
: