Target
Ubiquitin carboxyl-terminal hydrolase 47
Ligand
BDBM50393446
Substrate
Meas. Tech.
ChEMBL_855560 (CHEMBL2162865)
EC50
500±n/a nM
Citation
 Weinstock, JWu, JCao, PKingsbury, WDMcDermott, JLKodrasov, MPMcKelvey, DMSuresh Kumar, KGGoldenberg, SJMattern, MRNicholson, B Selective Dual Inhibitors of the Cancer-Related Deubiquitylating Proteases USP7 and USP47. ACS Med Chem Lett 3:789-792 (2012)  
Target
Name:
Ubiquitin carboxyl-terminal hydrolase 47
Synonyms:
Deubiquitinating enzyme 47 USP47 Ubiquitin-specific-processing protease 47
Type:
PROTEIN
Mol. Mass.:
157255.08
Organism:
Homo sapiens (Human)
Description:
ChEMBL_855560
Residue:
1375
  
Inhibitor
Name:
BDBM50393446
Synonyms:
CHEMBL2159505
Type:
Small organic molecule
Emp. Form.:
C17H11Cl2N3O5S3
Mol. Mass.:
504.387
SMILES:
CS(=O)(=O)c1ccc(NC(=O)c2cc(c(Sc3c(Cl)cncc3Cl)s2)[N+]([O-])=O)cc1
: