Target
Ubiquitin carboxyl-terminal hydrolase 47
Ligand
BDBM50393448
Substrate
Meas. Tech.
ChEMBL_855560 (CHEMBL2162865)
EC50
350±n/a nM
Citation
 Weinstock, JWu, JCao, PKingsbury, WDMcDermott, JLKodrasov, MPMcKelvey, DMSuresh Kumar, KGGoldenberg, SJMattern, MRNicholson, B Selective Dual Inhibitors of the Cancer-Related Deubiquitylating Proteases USP7 and USP47. ACS Med Chem Lett 3:789-792 (2012)  
Target
Name:
Ubiquitin carboxyl-terminal hydrolase 47
Synonyms:
Deubiquitinating enzyme 47 USP47 Ubiquitin-specific-processing protease 47
Type:
PROTEIN
Mol. Mass.:
157255.08
Organism:
Homo sapiens (Human)
Description:
ChEMBL_855560
Residue:
1375
  
Inhibitor
Name:
BDBM50393448
Synonyms:
CHEMBL2159507
Type:
Small organic molecule
Emp. Form.:
C22H20Cl2N4O2S2
Mol. Mass.:
507.456
SMILES:
CN(C)CCCOc1ccc(NC(=O)c2cc(C#N)c(Sc3c(Cl)cncc3Cl)s2)cc1
: