Target
Antithrombin-III/Coagulation factor X
Ligand
BDBM50393527
Substrate
Meas. Tech.
ChEMBL_856794 (CHEMBL2162912)
IC50
190000±n/a nM
Citation
 Correia-da-Silva, MSousa, EDuarte, BMarques, FCarvalho, FCunha-Ribeiro, LMPinto, MM Polysulfated xanthones: multipathway development of a new generation of dual anticoagulant/antiplatelet agents. J Med Chem 54:5373-84 (2011)  
Target
Name:
Antithrombin-III/Coagulation factor X
Synonyms:
Coagulation factor X/antithrombin III
Type:
Mol. Mass.:
Description:
ASSAY_ID of EBI is 856794
Components:
This complex has 2 components.
Component 1
Name:
Antithrombin-III
Synonyms:
ANT3_HUMAN ATIII Antithrombin-III precursor SERPINC1
Type:
PROTEIN
Mol. Mass.:
52602.34
Organism:
Homo sapiens (Human)
Description:
ChEMBL_35871
Residue:
464
  
Component 2
Name:
Coagulation factor X
Synonyms:
Activated coagulation factor X (FXa) Coagulation factor X precursor F10 Factor X heavy chain Factor Xa Stuart-Prower factor
Type:
Enzyme
Mol. Mass.:
54726.60
Organism:
Homo sapiens (Human)
Description:
Residue:
488
  
Inhibitor
Name:
BDBM50393527
Synonyms:
CHEMBL2158198
Type:
Small organic molecule
Emp. Form.:
C25H28O38S8
Mol. Mass.:
1192.987
SMILES:
OS(=O)(=O)OC[C@H]1O[C@@H](Oc2ccc3c(c2)oc2cc(O[C@@H]4O[C@H](COS(O)(=O)=O)[C@@H](OS(O)(=O)=O)[C@H](OS(O)(=O)=O)[C@H]4OS(O)(=O)=O)ccc2c3=O)[C@H](OS(O)(=O)=O)[C@@H](OS(O)(=O)=O)[C@@H]1OS(O)(=O)=O
: