Target
Sphingosine kinase 2
Ligand
BDBM50393642
Substrate
Meas. Tech.
ChEMBL_855991 (CHEMBL2161992)
Ki
9800±n/a nM
Citation
 Knott, KKharel, YRaje, MRLynch, KRSantos, WL Effect of alkyl chain length on sphingosine kinase 2 selectivity. Bioorg Med Chem Lett 22:6817-20 (2012)  
Target
Name:
Sphingosine kinase 2
Synonyms:
SK 2 SPHK2 SPK 2 Sphingosine kinase types 2 (SphK2)
Type:
Protein
Mol. Mass.:
69221.44
Organism:
Homo sapiens (Human)
Description:
Q9NRA0
Residue:
654
  
Inhibitor
Name:
BDBM50393642
Synonyms:
CHEMBL2158685
Type:
Small organic molecule
Emp. Form.:
C23H25ClN2O
Mol. Mass.:
380.91
SMILES:
Clc1ccc(cc1)C12CC3CC(CC(C3)(C1)C(=O)NCc1ccncc1)C2
: