Target
Smoothened homolog
Ligand
BDBM50394396
Substrate
Meas. Tech.
ChEMBL_854592 (CHEMBL2161253)
IC50
0.6±n/a nM
Citation
 Cheng, DHan, DGao, WJing, QJiang, JWan, YEnglund, NPTuntland, TWu, XPan, S Design, synthesis, and structure-activity-relationship of phenyl imidazoles as potent Smoothened antagonists. Bioorg Med Chem Lett 22:6573-6 (2012)  
Target
Name:
Smoothened homolog
Synonyms:
SMO_MOUSE Smoh
Type:
PROTEIN
Mol. Mass.:
87472.73
Organism:
Mus musculus
Description:
ChEMBL_1510377
Residue:
793
  
Inhibitor
Name:
BDBM50394396
Synonyms:
CHEMBL2160079
Type:
Small organic molecule
Emp. Form.:
C25H23N3O3
Mol. Mass.:
413.4684
SMILES:
COc1cc(OC)cc(c1)C(=O)Nc1ccc(C)c(c1)-c1nc(c[nH]1)-c1ccccc1
: