Target
Smoothened homolog
Ligand
BDBM50394400
Substrate
Meas. Tech.
ChEMBL_854592 (CHEMBL2161253)
IC50
0.3±n/a nM
Citation
 Cheng, DHan, DGao, WJing, QJiang, JWan, YEnglund, NPTuntland, TWu, XPan, S Design, synthesis, and structure-activity-relationship of phenyl imidazoles as potent Smoothened antagonists. Bioorg Med Chem Lett 22:6573-6 (2012)  
Target
Name:
Smoothened homolog
Synonyms:
SMO_MOUSE Smoh
Type:
PROTEIN
Mol. Mass.:
87472.73
Organism:
Mus musculus
Description:
ChEMBL_1510377
Residue:
793
  
Inhibitor
Name:
BDBM50394400
Synonyms:
CHEMBL2160070
Type:
Small organic molecule
Emp. Form.:
C30H28ClN5O
Mol. Mass.:
510.029
SMILES:
C[C@H]1CN(C[C@@H](C)O1)c1ccc2c(Nc3ccc(Cl)c(c3)-c3nc(c[nH]3)-c3ccccc3)cccc2n1
: