Target
D(3) dopamine receptor
Ligand
BDBM50131922
Substrate
Meas. Tech.
ChEMBL_860682 (CHEMBL2167999)
Ki
0.32±n/a nM
Citation
 Newman, AHBeuming, TBanala, AKDonthamsetti, PPongetti, KLaBounty, ALevy, BCao, JMichino, MLuedtke, RRJavitch, JAShi, L Molecular determinants of selectivity and efficacy at the dopamine D3 receptor. J Med Chem 55:6689-99 (2012)  
Target
Name:
D(3) dopamine receptor
Synonyms:
DOPAMINE D3 DRD3_HUMAN Dopamine D3 receptor (D3) Dopamine receptor Dopamine receptor D3
Type:
Mol. Mass.:
44243.43
Organism:
Homo sapiens (Human)
Description:
Residue:
400
  
Inhibitor
Name:
BDBM50131922
Synonyms:
1H-Indole-2-carboxylic acid {4-[4-(2-methoxy-phenyl)-piperazin-1-yl]-butyl}-amide N-(4-(4-(2-methoxyphenyl)piperazin-1-yl)butyl)-1H-indole-2-carboxamide
Type:
Small organic molecule
Emp. Form.:
C24H30N4O2
Mol. Mass.:
406.5206
SMILES:
COc1ccccc1N1CCN(CCCCNC(=O)c2cc3ccccc3[nH]2)CC1
: