Target
D(2) dopamine receptor
Ligand
BDBM50394929
Substrate
Meas. Tech.
ChEMBL_860683 (CHEMBL2168000)
Ki
45.9±n/a nM
Citation
 Newman, AHBeuming, TBanala, AKDonthamsetti, PPongetti, KLaBounty, ALevy, BCao, JMichino, MLuedtke, RRJavitch, JAShi, L Molecular determinants of selectivity and efficacy at the dopamine D3 receptor. J Med Chem 55:6689-99 (2012)  
Target
Name:
D(2) dopamine receptor
Synonyms:
D(2) dopamine receptor DOPAMINE D2 Long DRD2 Dopamine D2 receptor Dopamine D2 receptor (D2R) Dopamine2-like | d2
Type:
Cell-surface receptors
Mol. Mass.:
50647.10
Organism:
Homo sapiens (Human)
Description:
P14416
Residue:
443
  
Inhibitor
Name:
BDBM50394929
Synonyms:
CHEMBL2165673
Type:
Small organic molecule
Emp. Form.:
C11H14Cl2N2
Mol. Mass.:
245.148
SMILES:
CN1CCN(CC1)c1cccc(Cl)c1Cl
: