Target
Cannabinoid receptor 2
Ligand
BDBM50395153
Substrate
Meas. Tech.
ChEMBL_859793 (CHEMBL2169621)
Ki
9.51±n/a nM
Citation
 Baraldi, PGSaponaro, GMoorman, ARRomagnoli, RPreti, DBaraldi, SRuggiero, EVarani, KTarga, MVincenzi, FBorea, PAAghazadeh Tabrizi, M 7-Oxo-[1,4]oxazino[2,3,4-ij]quinoline-6-carboxamides as selective CB(2) cannabinoid receptor ligands: structural investigations around a novel class of full agonists. J Med Chem 55:6608-23 (2012)  
Target
Name:
Cannabinoid receptor 2
Synonyms:
CANNABINOID CB2 CB2 Cannabinoid CB2 receptor Cnr2 | rCB2
Type:
Enzyme
Mol. Mass.:
39366.68
Organism:
Rattus norvegicus (Rat)
Description:
Q9QZN9
Residue:
360
  
Inhibitor
Name:
BDBM50395153
Synonyms:
CHEMBL2163946
Type:
Small organic molecule
Emp. Form.:
C24H27FN2O3
Mol. Mass.:
410.4812
SMILES:
CCC1COc2c(F)ccc3c2n1cc(C(=O)NC12CC4CC(CC(C4)C1)C2)c3=O
: