Target
Cannabinoid receptor 2
Ligand
BDBM50395155
Substrate
Meas. Tech.
ChEMBL_859793 (CHEMBL2169621)
Ki
10.3±n/a nM
Citation
 Baraldi, PGSaponaro, GMoorman, ARRomagnoli, RPreti, DBaraldi, SRuggiero, EVarani, KTarga, MVincenzi, FBorea, PAAghazadeh Tabrizi, M 7-Oxo-[1,4]oxazino[2,3,4-ij]quinoline-6-carboxamides as selective CB(2) cannabinoid receptor ligands: structural investigations around a novel class of full agonists. J Med Chem 55:6608-23 (2012)  
Target
Name:
Cannabinoid receptor 2
Synonyms:
CANNABINOID CB2 CB2 Cannabinoid CB2 receptor Cnr2 | rCB2
Type:
Enzyme
Mol. Mass.:
39366.68
Organism:
Rattus norvegicus (Rat)
Description:
Q9QZN9
Residue:
360
  
Inhibitor
Name:
BDBM50395155
Synonyms:
CHEMBL2163943
Type:
Small organic molecule
Emp. Form.:
C25H28N2O3
Mol. Mass.:
404.5014
SMILES:
O=C(NC12CC3CC(CC(C3)C1)C2)c1cn2C(COc3cccc(c23)c1=O)C1CC1
: