Target
S-methylmethionine--homocysteine S-methyltransferase BHMT2
Ligand
BDBM50395382
Substrate
Meas. Tech.
ChEMBL_857981 (CHEMBL2166489)
IC50
3600±n/a nM
Citation
 Mládková, JVanek, VBudešínský, MElbert, TDemianová, ZGarrow, TAJirácek, J Double-headed sulfur-linked amino acids as first inhibitors for betaine-homocysteine S-methyltransferase 2. J Med Chem 55:6822-31 (2012)  
Target
Name:
S-methylmethionine--homocysteine S-methyltransferase BHMT2
Synonyms:
BHMT2 Betaine--homocysteine S-methyltransferase 2 | SMM-hcy methyltransferase
Type:
PROTEIN
Mol. Mass.:
40349.19
Organism:
Homo sapiens (Human)
Description:
ChEMBL_857981
Residue:
363
  
Inhibitor
Name:
BDBM50395382
Synonyms:
CHEMBL2164724
Type:
Small organic molecule
Emp. Form.:
C12H24N2O4S
Mol. Mass.:
292.395
SMILES:
CC(CCSCC[C@H](N)C(O)=O)CCC(N)C(O)=O
: