Target
Serine protease SplB
Ligand
BDBM50395600
Substrate
Meas. Tech.
ChEMBL_859707 (CHEMBL2169142)
Ki
>200000±n/a nM
Citation
 Ewa, BMaciej, WMarcin, SGrzegorz, DMichal, ZJan, PJózef, O The development of first Staphylococcus aureus SplB protease inhibitors: phosphonic analogues of glutamine. Bioorg Med Chem Lett 22:5574-8 (2012)  
Target
Name:
Serine protease SplB
Synonyms:
SPLB_STAAU | splB
Type:
PROTEIN
Mol. Mass.:
26147.73
Organism:
Staphylococcus aureus
Description:
ChEMBL_859707
Residue:
240
  
Inhibitor
Name:
BDBM50395600
Synonyms:
CHEMBL2165304
Type:
Small organic molecule
Emp. Form.:
C28H33N2O6P
Mol. Mass.:
524.5452
SMILES:
CCc1ccc(OP(=O)(Oc2ccc(CC)cc2)C(CCC(N)=O)NC(=O)OCc2ccccc2)cc1
: