Target
Corticotropin-releasing factor receptor 1
Ligand
BDBM50293912
Substrate
Meas. Tech.
ChEMBL_860640 (CHEMBL2167614)
IC50
0.26±n/a nM
Citation
 Deskus, JADischino, DDMattson, RJDitta, JLParker, MFDenhart, DJZuev, DHuang, HHartz, RAAhuja, VTWong, HMattson, GKMolski, TFGrace, JEZueva, LNielsen, JMDulac, HLi, YWGuaraldi, MAzure, MOnthank, DHayes, MWexler, EMcDonald, JLodge, NJBronson, JJMacor, JE [18F](R)-5-chloro-1-(1-cyclopropyl-2-methoxyethyl)-3-(4-(2-fluoroethoxy)-2,5-dimethyl phenylamino)pyrazin-2(1H)-one: introduction of N3-phenylpyrazinones as potential CRF-R1 PET imaging agents. Bioorg Med Chem Lett 22:6651-5 (2012)  
Target
Name:
Corticotropin-releasing factor receptor 1
Synonyms:
CRF-R CRFR1_RAT Corticotropin releasing factor receptor Corticotropin-releasing Factor Receptor 1 Crhr | Crhr1
Type:
G Protein-Coupled Receptor (GPCR)
Mol. Mass.:
47870.75
Organism:
Rattus norvegicus (rat)
Description:
Receptor binding assays were performed using rat cortex homogenate.
Residue:
415
  
Inhibitor
Name:
BDBM50293912
Synonyms:
(R)-5-chloro-1-(1-cyclopropyl-2-methoxyethyl)-3-(4-methoxy-2,5-dimethylphenylamino)pyrazin-2(1H)-one | CHEMBL559437
Type:
Small organic molecule
Emp. Form.:
C19H24ClN3O3
Mol. Mass.:
377.865
SMILES:
COC[C@@H](C1CC1)n1cc(Cl)nc(Nc2cc(C)c(OC)cc2C)c1=O
: