Target
Histone-lysine N-methyltransferase SUV39H1
Ligand
BDBM50396016
Substrate
Meas. Tech.
ChEMBL_861216 (CHEMBL2173354)
IC50
>100000±n/a nM
Citation
 Decarlo, DHadden, MK Oncoepigenomics: making histone lysine methylation count. Eur J Med Chem 56:179-194 (2012)  
Target
Name:
Histone-lysine N-methyltransferase SUV39H1
Synonyms:
H3-K9-HMTase 1 KMT1A Position-effect variegation 3-9 homolog SUV39H1 Su(var)3-9 homolog 1 | Suppressor of variegation 3-9 homolog 1
Type:
PROTEIN
Mol. Mass.:
47917.07
Organism:
Homo sapiens (Human)
Description:
ChEMBL_1473655
Residue:
412
  
Inhibitor
Name:
BDBM50396016
Synonyms:
CHEMBL2169918
Type:
Small organic molecule
Emp. Form.:
C24H32IN7O5
Mol. Mass.:
625.4593
SMILES:
N[C@@H](CCCN(CCI)C[C@H]1O[C@H]([C@H](O)[C@@H]1O)n1cnc2c(NCc3ccccc3)ncnc12)C(O)=O
: