Target
Aldo-keto reductase family 1 member C2
Ligand
BDBM50396704
Substrate
Meas. Tech.
ChEMBL_864145 (CHEMBL2175094)
IC50
>30000±n/a nM
Citation
 Jamieson, SMBrooke, DGHeinrich, DAtwell, GJSilva, SHamilton, EJTurnbull, APRigoreau, LJTrivier, ESoudy, CSamlal, SSOwen, PJSchroeder, ERaynham, TFlanagan, JUDenny, WA 3-(3,4-Dihydroisoquinolin-2(1H)-ylsulfonyl)benzoic Acids: highly potent and selective inhibitors of the type 5 17-ß-hydroxysteroid dehydrogenase AKR1C3. J Med Chem 55:7746-58 (2012)  
Target
Name:
Aldo-keto reductase family 1 member C2
Synonyms:
3-alpha-HSD3 AK1C2_HUMAN Aldo-keto reductase family 1 member C2 (AK1C2) Aldo-keto reductase family 1 member C2 (AKR1C2) DD-2 DDH2 Dihydrodiol dehydrogenase/bile acid-binding protein Type III 3-alpha-hydroxysteroid dehydrogenase
Type:
Enzyme
Mol. Mass.:
36739.89
Organism:
Homo sapiens (Human)
Description:
Residue:
323
  
Inhibitor
Name:
BDBM50396704
Synonyms:
CHEMBL2172072
Type:
Small organic molecule
Emp. Form.:
C17H18N2O3S
Mol. Mass.:
330.401
SMILES:
CNC(=O)c1cccc(c1)S(=O)(=O)N1CCc2ccccc2C1
: