Target
Phosphatidylinositol 4,5-bisphosphate 3-kinase catalytic subunit gamma isoform
Ligand
BDBM50396805
Substrate
Meas. Tech.
ChEMBL_861950 (CHEMBL2173754)
Ki
20±n/a nM
Citation
 Norman, MHAndrews, KLBo, YYBooker, SKCaenepeel, SCee, VJD'Angelo, NDFreeman, DJHerberich, BJHong, FTJackson, CLJiang, JLanman, BALiu, LMcCarter, JDMullady, ELNishimura, NPettus, LHReed, ABMiguel, TSSmith, ALStec, MMTadesse, STasker, AAidasani, DZhu, XSubramanian, RTamayo, NAWang, LWhittington, DAWu, BWu, TWurz, RPYang, KZalameda, LZhang, NHughes, PE Selective class I phosphoinositide 3-kinase inhibitors: optimization of a series of pyridyltriazines leading to the identification of a clinical candidate, AMG 511. J Med Chem 55:7796-816 (2012)  
Target
Name:
Phosphatidylinositol 4,5-bisphosphate 3-kinase catalytic subunit gamma isoform
Synonyms:
PI3-kinase p110 subunit gamma PI3Kgamma PK3CG_HUMAN Phosphatidylinositol 4,5-bisphosphate 3-kinase (PI3K) Phosphatidylinositol 4,5-bisphosphate 3-kinase catalytic subunit gamma (PI3Kgamma) Phosphatidylinositol 4,5-bisphosphate 3-kinase catalytic subunit gamma isoform (PI3K) Phosphatidylinositol-4,5-bisphosphate 3-kinase catalytic subunit gamma isoform Phosphoinositide 3-kinases gamma (PI3K gamma) p120-PI3K
Type:
Enzyme Subunit
Mol. Mass.:
126470.30
Organism:
Homo sapiens (Human)
Description:
P48736
Residue:
1102
  
Inhibitor
Name:
BDBM50396805
Synonyms:
CHEMBL2170084
Type:
Small organic molecule
Emp. Form.:
C22H25F4N9O3S
Mol. Mass.:
571.551
SMILES:
COc1ncc(Nc2ncc(cc2-c2nc(C)nc(N)n2)[C@@H](N2CCN(CC2)S(C)(=O)=O)C(F)(F)F)cc1F
: