Target
Vasopressin V2 receptor
Ligand
BDBM50397207
Substrate
Meas. Tech.
ChEMBL_864201 (CHEMBL2175253)
Kd
11.1±n/a nM
Citation
 Loison, SCottet, MOrcel, HAdihou, HRahmeh, RLamarque, LTrinquet, EKellenberger, EHibert, MDurroux, TMouillac, BBonnet, D Selective fluorescent nonpeptidic antagonists for vasopressin V2 GPCR: application to ligand screening and oligomerization assays. J Med Chem 55:8588-602 (2012)  
Target
Name:
Vasopressin V2 receptor
Synonyms:
ADHR AVPR2 DIR Renal-type arginine vasopressin receptor V2R_HUMAN Vasopressin V2 receptor | Vasopressin receptor
Type:
Receptor
Mol. Mass.:
40295.28
Organism:
Homo sapiens (Human)
Description:
P30518
Residue:
371
  
Inhibitor
Name:
BDBM50397207
Synonyms:
CHEMBL2172288
Type:
Small organic molecule
Emp. Form.:
C66H63N9O12S
Mol. Mass.:
1206.325
SMILES:
OC(=O)c1cc(NC(=S)NCCOCCOCCOCCn2cc(CNC(=O)CCC(=O)NC3CCCN(C(=O)c4ccc(NC(=O)c5ccccc5-c5ccccc5)cc4)c4ccccc34)nn2)ccc1-c1c2ccc(O)cc2oc2cc(=O)ccc12
: