Target
Oxytocin receptor
Ligand
BDBM50397215
Substrate
Meas. Tech.
ChEMBL_864195 (CHEMBL2175247)
Ki
>10000±n/a nM
Citation
 Loison, SCottet, MOrcel, HAdihou, HRahmeh, RLamarque, LTrinquet, EKellenberger, EHibert, MDurroux, TMouillac, BBonnet, D Selective fluorescent nonpeptidic antagonists for vasopressin V2 GPCR: application to ligand screening and oligomerization assays. J Med Chem 55:8588-602 (2012)  
Target
Name:
Oxytocin receptor
Synonyms:
OT-R OXYR_HUMAN | Oxytocin
Type:
Enzyme Catalytic Domain
Mol. Mass.:
42793.26
Organism:
Homo sapiens (Human)
Description:
Oxytocin OXTR HEK293::B2R9L7
Residue:
389
  
Inhibitor
Name:
BDBM50397215
Synonyms:
CHEMBL2172295
Type:
Small organic molecule
Emp. Form.:
C72H80N10O13S2
Mol. Mass.:
1357.595
SMILES:
CCN(CC)c1ccc2c(-c3ccc(cc3S([O-])(=O)=O)S(=O)(=O)NCCOCCOCCOCCn3cc(CNC(=O)CCC(=O)NC4CCCN(C(=O)c5ccc(NC(=O)c6ccccc6-c6ccccc6)cc5)c5ccccc45)nn3)c3ccc(cc3oc2c1)=[N+](CC)CC
: