Target
Cannabinoid receptor 2
Ligand
BDBM50397402
Substrate
Meas. Tech.
ChEMBL_864944 (CHEMBL2175894)
Ki
>1000±n/a nM
Citation
 El Bakali, JGilleron, PBody-Malapel, MMansouri, RMuccioli, GGDjouina, MBarczyk, AKlupsch, FAndrzejak, VLipka, EFurman, CLambert, DMChavatte, PDesreumaux, PMillet, R 4-Oxo-1,4-dihydropyridines as selective CB2 cannabinoid receptor ligands. Part 2: discovery of new agonists endowed with protective effect against experimental colitis. J Med Chem 55:8948-52 (2012)  
Target
Name:
Cannabinoid receptor 2
Synonyms:
CANNABINOID CB2 CB2 CB2B CNR2_HUMAN Cannabinoid CB2 receptor Cannabinoid receptor 2 (CB2R) | hCB2
Type:
G Protein-Coupled Receptor (GPCR)
Mol. Mass.:
39690.94
Organism:
Homo sapiens (Human)
Description:
P34972
Residue:
360
  
Inhibitor
Name:
BDBM50397402
Synonyms:
CHEMBL2170531
Type:
Small organic molecule
Emp. Form.:
C21H30N2O3
Mol. Mass.:
358.4745
SMILES:
COCCCn1cc(C(=O)NC23CC4CC(CC(C4)C2)C3)c(=O)cc1C
: