Target
Adenosine receptor A1
Ligand
BDBM50150766
Substrate
Meas. Tech.
ChEMBL_874129 (CHEMBL2187070)
Ki
1000±n/a nM
Citation
 Baraldi, PGPreti, DBorea, PAVarani, K Medicinal chemistry of A3 adenosine receptor modulators: pharmacological activities and therapeutic implications. J Med Chem 55:5676-703 (2012)  
Target
Name:
Adenosine receptor A1
Synonyms:
A1 adenosine receptor (hA1) AA1R_HUMAN ADORA1 Adenosine A1-receptor Adenosine receptor A1 (hA1) | Adenosine transporter (AdT)
Type:
G Protein-Coupled Receptor (GPCR)
Mol. Mass.:
36520.92
Organism:
Homo sapiens (Human)
Description:
P30542
Residue:
326
  
Inhibitor
Name:
BDBM50150766
Synonyms:
(2R,3R,4S,5R)-2-(6-amino-2-((S)-1-hydroxy-3-phenylpropan-2-ylamino)-9H-purin-9-yl)-5-(2-ethyl-2H-tetrazol-5-yl)tetrahydrofuran-3,4-diol CHEMBL186113 | GW-328267
Type:
Small organic molecule
Emp. Form.:
C21H26N10O4
Mol. Mass.:
482.4957
SMILES:
CCn1nnc(n1)[C@H]1O[C@H]([C@H](O)[C@@H]1O)n1cnc2c(N)nc(N[C@H](CO)Cc3ccccc3)nc12
: