Target
cAMP and cAMP-inhibited cGMP 3',5'-cyclic phosphodiesterase 10A
Ligand
BDBM50397973
Substrate
Meas. Tech.
ChEMBL_872942 (CHEMBL2187842)
IC50
0.003300±n/a nM
Citation
 Chappie, TAHelal, CJHou, X Current landscape of phosphodiesterase 10A (PDE10A) inhibition. J Med Chem 55:7299-331 (2012)  
Target
Name:
cAMP and cAMP-inhibited cGMP 3',5'-cyclic phosphodiesterase 10A
Synonyms:
3',5'-cyclic phosphodiesterase PDE10A Phosphodiesterase 10 (PDE10) | Phosphodiesterase 10A
Type:
Protein
Mol. Mass.:
88412.52
Organism:
Homo sapiens (Human)
Description:
Q9Y233
Residue:
1055
  
Inhibitor
Name:
BDBM50397973
Synonyms:
CHEMBL2180441
Type:
Small organic molecule
Emp. Form.:
C24H25F3N6O2S
Mol. Mass.:
518.555
SMILES:
Cc1nc2ccc(cc2nc1\C=C\c1nc(N[C@@H]2CCS(=O)(=O)C2)cc(n1)N1CCCC1)C(F)(F)F
: