Target
Neuronal acetylcholine receptor subunit alpha-4/beta-2
Ligand
BDBM50398319
Substrate
Meas. Tech.
ChEMBL_874933 (CHEMBL2183118)
IC50
22.2±n/a nM
Citation
 Zhang, HKEaton, JBYu, LFNys, MMazzolari, Avan Elk, RSmit, ABAlexandrov, VHanania, TSabath, EFedolak, ABrunner, DLukas, RJVistoli, GUlens, CKozikowski, AP Insights into the structural determinants required for high-affinity binding of chiral cyclopropane-containing ligands toa4ß2-nicotinic acetylcholine receptors: an integrated approach to behaviorally active nicotinic ligands. J Med Chem 55:8028-37 (2012)  
Target
Name:
Neuronal acetylcholine receptor subunit alpha-4/beta-2
Synonyms:
Neuronal acetylcholine receptor Alpha-4/Beta-2 Neuronal acetylcholine receptor; alpha4/beta2 | nAChR subtypes alpha4 beta2
Type:
Protein
Mol. Mass.:
Description:
Components:
This complex has 2 components.
Component 1
Name:
Neuronal acetylcholine receptor subunit alpha-4
Synonyms:
ACHA4_HUMAN CHRNA4 protein Neuronal acetylcholine receptor protein alpha-4 subunit Nicotinic acetylcholine receptor alpha4/beta2/alpha5
Type:
Mol. Mass.:
69963.49
Organism:
Homo sapiens (Human)
Description:
NACHRA4
Residue:
627
  
Component 2
Name:
Neuronal acetylcholine receptor subunit beta-2
Synonyms:
ACHB2_HUMAN Neuronal acetylcholine receptor protein beta-2 subunit | Nicotinic acetylcholine receptor alpha3/beta2/alpha5
Type:
Protein
Mol. Mass.:
57020.50
Organism:
Homo sapiens (Human)
Description:
P17787
Residue:
502
  
Inhibitor
Name:
BDBM50398319
Synonyms:
CHEMBL2177346
Type:
Small organic molecule
Emp. Form.:
C14H20N2O
Mol. Mass.:
232.3214
SMILES:
CC[C@H]1C[C@@H]1c1cncc(OC[C@@H]2CCN2)c1
: