Target
Soluble acetylcholine receptor
Ligand
BDBM50382466
Substrate
Meas. Tech.
ChEMBL_874930 (CHEMBL2183115)
Ki
979±n/a nM
Citation
 Zhang, HKEaton, JBYu, LFNys, MMazzolari, Avan Elk, RSmit, ABAlexandrov, VHanania, TSabath, EFedolak, ABrunner, DLukas, RJVistoli, GUlens, CKozikowski, AP Insights into the structural determinants required for high-affinity binding of chiral cyclopropane-containing ligands toa4ß2-nicotinic acetylcholine receptors: an integrated approach to behaviorally active nicotinic ligands. J Med Chem 55:8028-37 (2012)  
Target
Name:
Soluble acetylcholine receptor
Synonyms:
Acetylcholine Binding protein | Soluble acetylcholine receptor
Type:
Mol. Mass.:
26560.08
Organism:
Aplysia Californica
Description:
Q8WSF8
Residue:
236
  
Inhibitor
Name:
BDBM50382466
Synonyms:
CHEMBL2024087
Type:
Small organic molecule
Emp. Form.:
C14H20N2O2
Mol. Mass.:
248.3208
SMILES:
OCC[C@H]1C[C@@H]1c1cncc(OC[C@@H]2CCN2)c1
: