Target
C-C chemokine receptor type 5
Ligand
BDBM50145685
Substrate
Meas. Tech.
ChEMBL_875647 (CHEMBL2184878)
IC50
0.45±n/a nM
Citation
 Pease, JHoruk, R Chemokine receptor antagonists. J Med Chem 55:9363-92 (2012)  
Target
Name:
C-C chemokine receptor type 5
Synonyms:
C-C CKR-5 CC-CKR-5 CCR5 CCR5_HUMAN CHEMR13 HIV-1 fusion coreceptor
Type:
Enzyme
Mol. Mass.:
40540.21
Organism:
Homo sapiens (Human)
Description:
P51681
Residue:
352
  
Inhibitor
Name:
BDBM50145685
Synonyms:
(4,6-Dimethyl-pyrimidin-5-yl)-(4-{(S)-4-[(R)-2-methoxy-1-(4-trifluoromethyl-phenyl)-ethyl]-3-methyl-piperazin-1-yl}-4-methyl-piperidin-1-yl)-methanone | CHEMBL82301
Type:
Small organic molecule
Emp. Form.:
C28H38F3N5O2
Mol. Mass.:
533.6288
SMILES:
COC[C@H](N1CCN(C[C@@H]1C)C1(C)CCN(CC1)C(=O)c1c(C)ncnc1C)c1ccc(cc1)C(F)(F)F
: