Target
C-C chemokine receptor type 1
Ligand
BDBM50208999
Substrate
Meas. Tech.
ChEMBL_875645 (CHEMBL2184876)
Kd
1±n/a nM
Citation
 Pease, JHoruk, R Chemokine receptor antagonists. J Med Chem 55:9363-92 (2012)  
Target
Name:
C-C chemokine receptor type 1
Synonyms:
C-C CKR-1 CC-CKR-1 CCR1 CD_antigen=CD191 CMKR1 LD78 receptor Macrophage inflammatory protein 1-alpha receptor SCYAR1
Type:
Enzyme
Mol. Mass.:
41180.69
Organism:
Homo sapiens (Human)
Description:
P32246
Residue:
355
  
Inhibitor
Name:
BDBM50208999
Synonyms:
(R)-1-(2-(2-(4-(4-fluorobenzyl)-2-methylpiperazin-1-yl)-2-oxoethoxy)-5-chlorophenyl)urea BX-471 CHEMBL232656
Type:
Small organic molecule
Emp. Form.:
C21H24ClFN4O3
Mol. Mass.:
434.892
SMILES:
C[C@@H]1CN(Cc2ccc(F)cc2)CCN1C(=O)COc1ccc(Cl)cc1NC(N)=O
: