Target
Proteasome subunit beta type-2
Ligand
BDBM50329819
Substrate
Meas. Tech.
ChEMBL_874480 (CHEMBL2184803)
IC50
>100±n/a nM
Citation
 Kale, AJMoore, BS Molecular mechanisms of acquired proteasome inhibitor resistance. J Med Chem 55:10317-27 (2012)  
Target
Name:
Proteasome subunit beta type-2
Synonyms:
20S proteasome PSMB2 | Proteasome Macropain subunit
Type:
PROTEIN
Mol. Mass.:
22837.53
Organism:
Homo sapiens (Human)
Description:
ChEMBL_1294233
Residue:
201
  
Inhibitor
Name:
BDBM50329819
Synonyms:
(R)-1-((2S,3R)-3-hydroxy-2-(6-phenylpicolinamido)butanamido)-3-methylbutylboronic acid CHEMBL270515 | [(1R)-1-[[(2S,3R)-3-hydroxy-2-[(6-phenylpyridine-2-carbonyl)amino]-1-oxobutyl]amino]-3-methylbutyl]boronic acid
Type:
Small organic molecule
Emp. Form.:
C21H28BN3O5
Mol. Mass.:
413.275
SMILES:
CC(C)C[C@H](NC(=O)[C@@H](NC(=O)c1cccc(n1)-c1ccccc1)[C@@H](C)O)B(O)O
: