Target
Proteasome subunit beta type-5
Ligand
BDBM50069989
Substrate
Meas. Tech.
ChEMBL_874481 (CHEMBL2184804)
IC50
7.9±n/a nM
Citation
 Kale, AJMoore, BS Molecular mechanisms of acquired proteasome inhibitor resistance. J Med Chem 55:10317-27 (2012)  
Target
Name:
Proteasome subunit beta type-5
Synonyms:
20S proteasome chymotrypsin-like LMPX PSB5_HUMAN Proteasome Macropain subunit MB1 X
Type:
Protein
Mol. Mass.:
28480.96
Organism:
Homo sapiens (Human)
Description:
Residue:
263
  
Inhibitor
Name:
BDBM50069989
Synonyms:
(R)-3-methyl-1-((S)-3-phenyl-2-(pyrazine-2-carboxamido)propanamido)butylboronic acid BORTEZOMIB Dipeptidyl boronic acid derivative N-[(1R)-1-(DIHYDROXYBORYL)-3-METHYLBUTYL]-N-(PYRAZIN-2-YLCARBONYL)-L-PHENYLALANINAMIDE Peptidyl boronic acid derivative Velcade | cid_387447
Type:
Small organic molecule
Emp. Form.:
C19H25BN4O4
Mol. Mass.:
384.237
SMILES:
CC(C)C[C@H](NC(=O)[C@H](Cc1ccccc1)NC(=O)c1cnccn1)B(O)O
: