Target
Beta-secretase 1
Ligand
BDBM50398683
Substrate
Meas. Tech.
ChEMBL_874976 (CHEMBL2183852)
IC50
8±n/a nM
Citation
 Mandal, MZhu, ZCumming, JNLiu, XStrickland, CMazzola, RDCaldwell, JPLeach, PGrzelak, MHyde, LZhang, QTerracina, GZhang, LChen, XKuvelkar, RKennedy, MEFavreau, LCox, KOrth, PBuevich, AVoigt, JWang, HKazakevich, IMcKittrick, BAGreenlee, WParker, EMStamford, AW Design and validation of bicyclic iminopyrimidinones as beta amyloid cleaving enzyme-1 (BACE1) inhibitors: conformational constraint to favor a bioactive conformation. J Med Chem 55:9331-45 (2012)  
Target
Name:
Beta-secretase 1
Synonyms:
ASP2 Aspartyl protease 2 BACE1 Beta-secretase (BACE) Beta-secretase 1 (BACE 1) Beta-secretase 1 (BACE1) Beta-site amyloid precursor protein cleaving enzyme 1 Memapsin-2 beta-Secretase (BACE-1) | beta-Secretase (BACE1)
Type:
Protein
Mol. Mass.:
55755.10
Organism:
Homo sapiens (Human)
Description:
P56817
Residue:
501
  
Inhibitor
Name:
BDBM50398683
Synonyms:
CHEMBL2178147
Type:
Small organic molecule
Emp. Form.:
C26H22FN5O2S
Mol. Mass.:
487.549
SMILES:
CC#Cc1cncc(c1)-c1csc(c1)[C@]12CN(C[C@H]1C(=O)N(C)C(N)=N2)C(=O)c1cccc(F)c1
: