Target
Mu-type opioid receptor
Ligand
BDBM50398758
Substrate
Meas. Tech.
ChEMBL_876436 (CHEMBL2186797)
EC50
2.2±n/a nM
Citation
 Ananthan, SSaini, SKDersch, CMXu, HMcGlinchey, NGiuvelis, DBilsky, EJRothman, RB 14-Alkoxy- and 14-acyloxypyridomorphinans:µ agonist/d antagonist opioid analgesics with diminished tolerance and dependence side effects. J Med Chem 55:8350-63 (2012)  
Target
Name:
Mu-type opioid receptor
Synonyms:
M-OR-1 MOR-1 MUOR1 Mu opiate receptor OPRM1 hMOP | mu-type opioid receptor isoform MOR-1
Type:
G Protein-Coupled Receptor (GPCR)
Mol. Mass.:
44789.51
Organism:
Homo sapiens (Human)
Description:
P35372
Residue:
400
  
Inhibitor
Name:
BDBM50398758
Synonyms:
CHEMBL2179656
Type:
Small organic molecule
Emp. Form.:
C35H33ClN2O3
Mol. Mass.:
565.101
SMILES:
CN1CC[C@@]23[C@H]4Oc5c2c(C[C@@H]1[C@@]3(Cc1cc(cnc41)-c1ccc(Cl)cc1)OCCCc1ccccc1)ccc5O
: