Target
Kappa-type opioid receptor
Ligand
BDBM50398758
Substrate
Meas. Tech.
ChEMBL_876449 (CHEMBL2187201)
Ki
1.5±n/a nM
Citation
 Ananthan, SSaini, SKDersch, CMXu, HMcGlinchey, NGiuvelis, DBilsky, EJRothman, RB 14-Alkoxy- and 14-acyloxypyridomorphinans:µ agonist/d antagonist opioid analgesics with diminished tolerance and dependence side effects. J Med Chem 55:8350-63 (2012)  
Target
Name:
Kappa-type opioid receptor
Synonyms:
K-OR-1 Kappa-opioid receptor (KOR) Kappa-type opioid receptor (KOR) OPIATE Kappa OPRK1 kappa opioid receptor (KOR)
Type:
G Protein-Coupled Receptor (GPCR)
Mol. Mass.:
42648.76
Organism:
Homo sapiens (Human)
Description:
P41145
Residue:
380
  
Inhibitor
Name:
BDBM50398758
Synonyms:
CHEMBL2179656
Type:
Small organic molecule
Emp. Form.:
C35H33ClN2O3
Mol. Mass.:
565.101
SMILES:
CN1CC[C@@]23[C@H]4Oc5c2c(C[C@@H]1[C@@]3(Cc1cc(cnc41)-c1ccc(Cl)cc1)OCCCc1ccccc1)ccc5O
: