Target
P2X purinoceptor 4
Ligand
BDBM50399177
Substrate
Meas. Tech.
ChEMBL_876885 (CHEMBL2184479)
IC50
9540±n/a nM
Citation
 Hernandez-Olmos, VAbdelrahman, AEl-Tayeb, AFreudendahl, DWeinhausen, SMüller, CE N-substituted phenoxazine and acridone derivatives: structure-activity relationships of potent P2X4 receptor antagonists. J Med Chem 55:9576-88 (2012)  
Target
Name:
P2X purinoceptor 4
Synonyms:
ATP receptor P2RX4_HUMAN Purinergic receptor | Purinergic, P2X4
Type:
Enzyme Catalytic Domain
Mol. Mass.:
43374.70
Organism:
Homo sapiens (Human)
Description:
Purinergic, P2X4 0 HUMAN::Q99571
Residue:
388
  
Inhibitor
Name:
BDBM50399177
Synonyms:
CHEMBL2180169
Type:
Small organic molecule
Emp. Form.:
C20H15ClN2O2
Mol. Mass.:
350.798
SMILES:
Clc1ccc(CNC(=O)N2c3ccccc3Oc3ccccc23)cc1
: