Target
P2X purinoceptor 1
Ligand
BDBM50399190
Substrate
Meas. Tech.
ChEMBL_876874 (CHEMBL2184468)
IC50
602±n/a nM
Citation
 Hernandez-Olmos, VAbdelrahman, AEl-Tayeb, AFreudendahl, DWeinhausen, SMüller, CE N-substituted phenoxazine and acridone derivatives: structure-activity relationships of potent P2X4 receptor antagonists. J Med Chem 55:9576-88 (2012)  
Target
Name:
P2X purinoceptor 1
Synonyms:
ATP receptor P2RX1_HUMAN Purinergic receptor | Purinergic, P2X
Type:
Enzyme Catalytic Domain
Mol. Mass.:
44992.65
Organism:
Homo sapiens (Human)
Description:
Purinergic, P2X 0 HUMAN::P51575
Residue:
399
  
Inhibitor
Name:
BDBM50399190
Synonyms:
CHEMBL2180149
Type:
Small organic molecule
Emp. Form.:
C26H21NO
Mol. Mass.:
363.451
SMILES:
OC1(c2ccccc2)c2ccccc2N(Cc2ccccc2)c2ccccc12
: