Target
Adenosine receptor A2b
Ligand
BDBM50399568
Substrate
Meas. Tech.
ChEMBL_878512 (CHEMBL2188177)
Ki
2620±n/a nM
Citation
 Federico, SCiancetta, ASabbadin, DPaoletta, SPastorin, GCacciari, BKlotz, KNMoro, SSpalluto, G Exploring the directionality of 5-substitutions in a new series of 5-alkylaminopyrazolo[4,3-e]1,2,4-triazolo[1,5-c]pyrimidine as a strategy to design novel human a(3) adenosine receptor antagonists. J Med Chem 55:9654-68 (2012)  
Target
Name:
Adenosine receptor A2b
Synonyms:
AA2BR_HUMAN ADORA2B Adenosine receptors A2b | Adenosine receptors; A2a & A2b
Type:
G Protein-Coupled Receptor (GPCR)
Mol. Mass.:
36341.22
Organism:
Homo sapiens (Human)
Description:
Residue:
332
  
Inhibitor
Name:
BDBM50399568
Synonyms:
CHEMBL2180935
Type:
Small organic molecule
Emp. Form.:
C18H14ClN7O
Mol. Mass.:
379.803
SMILES:
Cn1cc2c(n1)nc(NCc1ccc(Cl)cc1)n1nc(nc21)-c1ccco1
: