Target
5-hydroxytryptamine receptor 7
Ligand
BDBM50399619
Substrate
Meas. Tech.
ChEMBL_878519 (CHEMBL2188184)
Ki
384±n/a nM
Citation
 Dubost, EDumas, NFossey, CMagnelli, RButt-Gueulle, SBallandonne, CCaignard, DHDulin, FSopkova de-Oliveira Santos, JMillet, PCharnay, YRault, SCailly, TFabis, F Synthesis and structure-affinity relationships of selective high-affinity 5-HT(4) receptor antagonists: application to the design of new potential single photon emission computed tomography tracers. J Med Chem 55:9693-707 (2012)  
Target
Name:
5-hydroxytryptamine receptor 7
Synonyms:
5-HT-7 5-HT7 5-HT7S 5HT7 HTR7 | Serotonin receptor 7
Type:
G Protein-Coupled Receptor (GPCR)
Mol. Mass.:
53573.08
Organism:
Homo sapiens (Human)
Description:
P34969
Residue:
479
  
Inhibitor
Name:
BDBM50399619
Synonyms:
CHEMBL2181189
Type:
Small organic molecule
Emp. Form.:
C22H25FN2O
Mol. Mass.:
352.4451
SMILES:
CCCN1CCC(COc2nc3c(F)cccc3c3ccccc23)CC1
: