Target
Apoptosis regulator Bcl-2
Ligand
BDBM50400183
Substrate
Meas. Tech.
ChEMBL_878600 (CHEMBL2188685)
Ki
1700±n/a nM
Citation
 Zhang, ZLi, XSong, TZhao, YFeng, Y An anthraquinone scaffold for putative, two-face Bim BH3a-helix mimic. J Med Chem 55:10735-41 (2012)  
Target
Name:
Apoptosis regulator Bcl-2
Synonyms:
Apoptosis regulator Bcl-2 Protein BCL-2 BCL2_HUMAN | Bcl-2 Protein
Type:
Homodimer or heterodimer
Mol. Mass.:
26269.11
Organism:
Homo sapiens (Human)
Description:
P10415
Residue:
239
  
Inhibitor
Name:
BDBM50400183
Synonyms:
Purpuro (Ligand 1) | XANTHOPURPURIN
Type:
Small organic molecule
Emp. Form.:
C14H8O4
Mol. Mass.:
240.2109
SMILES:
Oc1cc(O)c2C(=O)c3ccccc3C(=O)c2c1
: