Target
Cannabinoid receptor 2
Ligand
BDBM50401070
Substrate
Meas. Tech.
ChEMBL_882431 (CHEMBL2210670)
Ki
2.2±n/a nM
Citation
 Wiley, JLSmith, VJChen, JMartin, BRHuffman, JW Synthesis and pharmacology of 1-alkyl-3-(1-naphthoyl)indoles: steric and electronic effects of 4- and 8-halogenated naphthoyl substituents. Bioorg Med Chem 20:2067-81 (2012)  
Target
Name:
Cannabinoid receptor 2
Synonyms:
CANNABINOID CB2 CB2 CB2B CNR2_HUMAN Cannabinoid CB2 receptor Cannabinoid receptor 2 (CB2R) | hCB2
Type:
G Protein-Coupled Receptor (GPCR)
Mol. Mass.:
39690.94
Organism:
Homo sapiens (Human)
Description:
P34972
Residue:
360
  
Inhibitor
Name:
BDBM50401070
Synonyms:
CHEMBL2206856
Type:
Small organic molecule
Emp. Form.:
C25H24FNO
Mol. Mass.:
373.4626
SMILES:
CCCCCn1c(C)c(C(=O)c2ccc(F)c3ccccc23)c2ccccc12
: