Target
Cannabinoid receptor 1
Ligand
BDBM50401047
Substrate
Meas. Tech.
ChEMBL_882430 (CHEMBL2210669)
Ki
73±n/a nM
Citation
 Wiley, JLSmith, VJChen, JMartin, BRHuffman, JW Synthesis and pharmacology of 1-alkyl-3-(1-naphthoyl)indoles: steric and electronic effects of 4- and 8-halogenated naphthoyl substituents. Bioorg Med Chem 20:2067-81 (2012)  
Target
Name:
Cannabinoid receptor 1
Synonyms:
CANN6 CB-R CNR CNR1_HUMAN Cannabinoid receptor Cannabinoid receptor 1 (brain)
Type:
G Protein-Coupled Receptor (GPCR)
Mol. Mass.:
52868.96
Organism:
Homo sapiens (Human)
Description:
P21554
Residue:
472
  
Inhibitor
Name:
BDBM50401047
Synonyms:
CHEMBL2206850
Type:
Small organic molecule
Emp. Form.:
C24H22INO
Mol. Mass.:
467.3421
SMILES:
CCCCCn1cc(C(=O)c2cccc3cccc(I)c23)c2ccccc12
: